WP Emerge installation issues

I’m struggling to install WP Emerge, I’ve got everything that’s required:

* [**PHP**](http://php.net/) \>= 5.5 – mine is 8.1 (tried with 7.4 too)
* [**WordPress**](https://wordpress.org/) \>= 4.7
* [**Composer**](https://getcomposer.org/) = mine is 2.3.10
* [**Node.js**](https://nodejs.org/en/) \>= 12 – mine is 16.15.1
* [**Yarn**](https://yarnpkg.com/en/) or NPM – my NPM is 8.16

That’s the log:

C:\\wamp64\\www\\wordpress\\wp-content\\themes>composer create-project htmlburger/wpemerge-theme wpe

Creating a “htmlburger/wpemerge-theme” project at “./wpe”

Info from [https://repo.packagist.org](https://repo.packagist.org): #StandWithUkraine

Installing htmlburger/wpemerge-theme (0.17.1)

\- Installing htmlburger/wpemerge-theme (0.17.1): Extracting archive

Created project in C:\\wamp64\\www\\wordpress\\wp-content\\themes\\wpe

Loading composer repositories with package information

Updating dependencies

Lock file operations: 26 installs, 0 updates, 0 removals

\- Locking composer/installers (v1.12.0)

\- Locking dealerdirect/phpcodesniffer-composer-installer (v0.7.2)

\- Locking filp/whoops (2.13.0)

\- Locking guzzlehttp/psr7 (1.9.0)

\- Locking htmlburger/wpemerge (0.17.0)

\- Locking htmlburger/wpemerge-app-core (0.17.0)

\- Locking htmlburger/wpemerge-cli (0.17.0)

\- Locking pimple/pimple (v3.5.0)

\- Locking psr/container (1.1.2)

\- Locking psr/http-message (1.0.1)

\- Locking psr/log (1.1.4)

\- Locking ralouphie/getallheaders (3.0.3)

\- Locking squizlabs/php\_codesniffer (3.7.1)

\- Locking symfony/console (v5.4.11)

\- Locking symfony/debug (v3.4.47)

\- Locking symfony/deprecation-contracts (v3.1.1)

\- Locking symfony/polyfill-ctype (v1.26.0)

\- Locking symfony/polyfill-intl-grapheme (v1.26.0)

\- Locking symfony/polyfill-intl-normalizer (v1.26.0)

\- Locking symfony/polyfill-mbstring (v1.26.0)

\- Locking symfony/polyfill-php73 (v1.26.0)

\- Locking symfony/polyfill-php80 (v1.26.0)

\- Locking symfony/process (v5.4.11)

\- Locking symfony/service-contracts (v2.5.2)

\- Locking symfony/string (v6.1.3)

\- Locking wp-coding-standards/wpcs (2.3.0)

Writing lock file

Installing dependencies from lock file (including require-dev)

Package operations: 26 installs, 0 updates, 0 removals

composer/installers contains a Composer plugin which is currently not in your allow-plugins config. See [https://getcomposer.org/allow-plugins](https://getcomposer.org/allow-plugins)

Do you trust “composer/installers” to execute code and wish to enable it now? (writes “allow-plugins” to composer.json) \[y,n,d,?\] y

\- Installing composer/installers (v1.12.0): Extracting archive

\- Installing squizlabs/php\_codesniffer (3.7.1): Extracting archive

dealerdirect/phpcodesniffer-composer-installer contains a Composer plugin which is currently not in your allow-plugins config. See [https://getcomposer.org/allow-plugins](https://getcomposer.org/allow-plugins)

Do you trust “dealerdirect/phpcodesniffer-composer-installer” to execute code and wish to enable it now? (writes “allow-plugins” to composer.json) \[y,n,d,?\] y

\- Installing dealerdirect/phpcodesniffer-composer-installer (v0.7.2): Extracting archive

\- Installing psr/log (1.1.4): Extracting archive

\- Installing filp/whoops (2.13.0): Extracting archive

\- Installing ralouphie/getallheaders (3.0.3): Extracting archive

\- Installing psr/http-message (1.0.1): Extracting archive

\- Installing guzzlehttp/psr7 (1.9.0): Extracting archive

\- Installing psr/container (1.1.2): Extracting archive

\- Installing pimple/pimple (v3.5.0): Extracting archive

\- Installing htmlburger/wpemerge (0.17.0): Extracting archive

\- Installing htmlburger/wpemerge-app-core (0.17.0): Extracting archive

\- Installing symfony/polyfill-php80 (v1.26.0): Extracting archive

\- Installing symfony/process (v5.4.11): Extracting archive

\- Installing symfony/polyfill-mbstring (v1.26.0): Extracting archive

\- Installing symfony/polyfill-intl-normalizer (v1.26.0): Extracting archive

\- Installing symfony/polyfill-intl-grapheme (v1.26.0): Extracting archive

\- Installing symfony/polyfill-ctype (v1.26.0): Extracting archive

\- Installing symfony/string (v6.1.3): Extracting archive

\- Installing symfony/deprecation-contracts (v3.1.1): Extracting archive

\- Installing symfony/service-contracts (v2.5.2): Extracting archive

\- Installing symfony/polyfill-php73 (v1.26.0): Extracting archive

\- Installing symfony/console (v5.4.11): Extracting archive

\- Installing htmlburger/wpemerge-cli (0.17.0): Extracting archive

\- Installing symfony/debug (v3.4.47): Extracting archive

\- Installing wp-coding-standards/wpcs (2.3.0): Extracting archive

6 package suggestions were added by new dependencies, use \`composer suggest\` to see details.

Package symfony/debug is abandoned, you should avoid using it. Use symfony/error-handler instead.

Generating autoload files

15 packages you are using are looking for funding.

Use the \`composer fund\` command to find out more!

PHP CodeSniffer Config installed\_paths set to ../../wp-coding-standards/wpcs

\> u/php wpemerge config:create

\> u/php wpemerge install:dependencies

npm WARN deprecated stable@0.1.8: Modern JS already guarantees Array#sort() is a stable sort, so this library is deprecated. See the compatibility table on MDN: [https://developer.mozilla.org/en-US/docs/Web/JavaScript/Reference/Global\_Objects/Array/sort#browser\_compatibility](https://developer.mozilla.org/en-US/docs/Web/JavaScript/Reference/Global_Objects/Array/sort#browser_compatibility)

npm WARN deprecated source-map-url@0.4.1: See [https://github.com/lydell/source-map-url#deprecated](https://github.com/lydell/source-map-url#deprecated)

​

npm WARN deprecated u/stylelint/postcss-markdown@0.36.2: Use the original unforked package instead: postcss-markdown

npm WARN deprecated har-validator@5.1.5: this library is no longer supported

npm WARN deprecated urix@0.1.0: Please see [https://github.com/lydell/urix#deprecated](https://github.com/lydell/urix#deprecated)

​

npm WARN deprecated source-map-resolve@0.5.3: See [https://github.com/lydell/source-map-resolve#deprecated](https://github.com/lydell/source-map-resolve#deprecated)

npm WARN deprecated chokidar@2.1.8: Chokidar 2 does not receive security updates since 2019. Upgrade to chokidar 3 with 15x fewer dependencies

npm WARN deprecated chokidar@2.1.8: Chokidar 2 does not receive security updates since 2019. Upgrade to chokidar 3 with 15x fewer dependencies

​

npm WARN deprecated resolve-url@0.2.1: [https://github.com/lydell/resolve-url#deprecated](https://github.com/lydell/resolve-url#deprecated)

npm WARN deprecated html-webpack-plugin@3.2.0: 3.x is no longer supported

​

npm WARN deprecated querystring@0.2.0: The querystring API is considered Legacy. new code should use the URLSearchParams API instead.

​

npm WARN deprecated uuid@3.4.0: Please upgrade to version 7 or higher. Older versions may use Math.random() in certain circumstances, which is known to be problematic. See [https://v8.dev/blog/math-random](https://v8.dev/blog/math-random) for details.

npm WARN deprecated request@2.88.2: request has been deprecated, see [https://github.com/request/request/issues/3142](https://github.com/request/request/issues/3142)

​

npm WARN deprecated svgo@1.3.2: This SVGO version is no longer supported. Upgrade to v2.x.x.

​

npm WARN deprecated tar@2.2.2: This version of tar is no longer supported, and will not receive security updates. Please upgrade asap.

​

npm WARN deprecated core-js@2.6.12: core-js@<3.23.3 is no longer maintained and not recommended for usage due to the number of issues. Because of the V8 engine whims, feature detection in old core-js versions could cause a slowdown up to 100x even if nothing is polyfilled. Some versions have web compatibility issues. Please, upgrade your dependencies to the actual version of core-js.

&#x200B;

npm WARN cleanup Failed to remove some directories \[

npm WARN cleanup \[

npm WARN cleanup ‘C:\\\\wamp64\\\\www\\\\wordpress\\\\wp-content\\\\themes\\\\wpe\\\\node\_modules’,

npm WARN cleanup \[Error: EBUSY: resource busy or locked, rmdir ‘C:\\wamp64\\www\\wordpress\\wp-content\\themes\\wpe\\node\_modules\\jpegtran-bin’\] {

npm WARN cleanup errno: -4082,

npm WARN cleanup code: ‘EBUSY’,

npm WARN cleanup syscall: ‘rmdir’,

npm WARN cleanup path: ‘C:\\\\wamp64\\\\www\\\\wordpress\\\\wp-content\\\\themes\\\\wpe\\\\node\_modules\\\\jpegtran-bin’

npm WARN cleanup }

npm WARN cleanup \]

npm WARN cleanup \]

npm ERR! code 1

npm ERR! path C:\\wamp64\\www\\wordpress\\wp-content\\themes\\wpe\\node\_modules\\node-sass

npm ERR! command failed

npm ERR! command C:\\WINDOWS\\system32\\cmd.exe /d /s /c C:\\Users\\Admin\\AppData\\Local\\Temp\\postinstall-7f969d63.cmd

npm ERR! Building: C:\\Program Files\\nodejs\\node.exe C:\\wamp64\\www\\wordpress\\wp-content\\themes\\wpe\\node\_modules\\node-gyp\\bin\\node-gyp.js rebuild –verbose –libsass\_ext= –libsass\_cflags= –libsass\_ldflags= –libsass\_library=

npm ERR! gyp info it worked if it ends with ok

npm ERR! gyp verb cli \[

npm ERR! gyp verb cli ‘C:\\\\Program Files\\\\nodejs\\\\node.exe’,

npm ERR! gyp verb cli ‘C:\\\\wamp64\\\\www\\\\wordpress\\\\wp-content\\\\themes\\\\wpe\\\\node\_modules\\\\node-gyp\\\\bin\\\\node-gyp.js’,npm ERR! gyp verb cli ‘rebuild’,

npm ERR! gyp verb cli ‘–verbose’,

npm ERR! gyp verb cli ‘–libsass\_ext=’,

npm ERR! gyp verb cli ‘–libsass\_cflags=’,

npm ERR! gyp verb cli ‘–libsass\_ldflags=’,

npm ERR! gyp verb cli ‘–libsass\_library=’

npm ERR! gyp verb cli \]

npm ERR! gyp info using node-gyp@3.8.0

npm ERR! gyp info using node@16.15.1 | win32 | x64

npm ERR! gyp verb command rebuild \[\]

npm ERR! gyp verb command clean \[\]

npm ERR! gyp verb clean removing “build” directory

npm ERR! gyp verb command configure \[\]

npm ERR! gyp verb check python checking for Python executable “python2” in the PATH

npm ERR! gyp verb \`which\` failed Error: not found: python2

npm ERR! gyp verb \`which\` failed at getNotFoundError (C:\\wamp64\\www\\wordpress\\wp-content\\themes\\wpe\\node\_modules\\node-gyp\\node\_modules\\which\\which.js:13:12)

npm ERR! gyp verb \`which\` failed at F (C:\\wamp64\\www\\wordpress\\wp-content\\themes\\wpe\\node\_modules\\node-gyp\\node\_modules\\which\\which.js:68:19)

npm ERR! gyp verb \`which\` failed at E (C:\\wamp64\\www\\wordpress\\wp-content\\themes\\wpe\\node\_modules\\node-gyp\\node\_modules\\which\\which.js:80:29)

npm ERR! gyp verb \`which\` failed at C:\\wamp64\\www\\wordpress\\wp-content\\themes\\wpe\\node\_modules\\node-gyp\\node\_modules\\which\\which.js:89:16

npm ERR! gyp verb \`which\` failed at C:\\wamp64\\www\\wordpress\\wp-content\\themes\\wpe\\node\_modules\\isexe\\index.js:42:5

npm ERR! gyp verb \`which\` failed at C:\\wamp64\\www\\wordpress\\wp-content\\themes\\wpe\\node\_modules\\isexe\\windows.js:36:5npm ERR! gyp verb \`which\` failed at FSReqCallback.oncomplete (node:fs:198:21)

npm ERR! gyp verb \`which\` failed python2 Error: not found: python2

npm ERR! gyp verb \`which\` failed at getNotFoundError (C:\\wamp64\\www\\wordpress\\wp-content\\themes\\wpe\\node\_modules\\node-gyp\\node\_modules\\which\\which.js:13:12)

npm ERR! gyp verb \`which\` failed at F (C:\\wamp64\\www\\wordpress\\wp-content\\themes\\wpe\\node\_modules\\node-gyp\\node\_modules\\which\\which.js:68:19)

npm ERR! gyp verb \`which\` failed at E (C:\\wamp64\\www\\wordpress\\wp-content\\themes\\wpe\\node\_modules\\node-gyp\\node\_modules\\which\\which.js:80:29)

npm ERR! gyp verb \`which\` failed at C:\\wamp64\\www\\wordpress\\wp-content\\themes\\wpe\\node\_modules\\node-gyp\\node\_modules\\which\\which.js:89:16

npm ERR! gyp verb \`which\` failed at C:\\wamp64\\www\\wordpress\\wp-content\\themes\\wpe\\node\_modules\\isexe\\index.js:42:5

npm ERR! gyp verb \`which\` failed at C:\\wamp64\\www\\wordpress\\wp-content\\themes\\wpe\\node\_modules\\isexe\\windows.js:36:5npm ERR! gyp verb \`which\` failed at FSReqCallback.oncomplete (node:fs:198:21) {

npm ERR! gyp verb \`which\` failed code: ‘ENOENT’

npm ERR! gyp verb \`which\` failed }

npm ERR! gyp verb check python checking for Python executable “python” in the PATH

npm ERR! gyp verb \`which\` failed Error: not found: python

npm ERR! gyp verb \`which\` failed at getNotFoundError (C:\\wamp64\\www\\wordpress\\wp-content\\themes\\wpe\\node\_modules\\node-gyp\\node\_modules\\which\\which.js:13:12)

npm ERR! gyp verb \`which\` failed at F (C:\\wamp64\\www\\wordpress\\wp-content\\themes\\wpe\\node\_modules\\node-gyp\\node\_modules\\which\\which.js:68:19)

npm ERR! gyp verb \`which\` failed at E (C:\\wamp64\\www\\wordpress\\wp-content\\themes\\wpe\\node\_modules\\node-gyp\\node\_modules\\which\\which.js:80:29)

npm ERR! gyp verb \`which\` failed at C:\\wamp64\\www\\wordpress\\wp-content\\themes\\wpe\\node\_modules\\node-gyp\\node\_modules\\which\\which.js:89:16

npm ERR! gyp verb \`which\` failed at C:\\wamp64\\www\\wordpress\\wp-content\\themes\\wpe\\node\_modules\\isexe\\index.js:42:5

npm ERR! gyp verb \`which\` failed at C:\\wamp64\\www\\wordpress\\wp-content\\themes\\wpe\\node\_modules\\isexe\\windows.js:36:5npm ERR! gyp verb \`which\` failed at FSReqCallback.oncomplete (node:fs:198:21)

npm ERR! gyp verb \`which\` failed python Error: not found: python

npm ERR! gyp verb \`which\` failed at getNotFoundError (C:\\wamp64\\www\\wordpress\\wp-content\\themes\\wpe\\node\_modules\\node-gyp\\node\_modules\\which\\which.js:13:12)

npm ERR! gyp verb \`which\` failed at F (C:\\wamp64\\www\\wordpress\\wp-content\\themes\\wpe\\node\_modules\\node-gyp\\node\_modules\\which\\which.js:68:19)

npm ERR! gyp verb \`which\` failed at E (C:\\wamp64\\www\\wordpress\\wp-content\\themes\\wpe\\node\_modules\\node-gyp\\node\_modules\\which\\which.js:80:29)

npm ERR! gyp verb \`which\` failed at C:\\wamp64\\www\\wordpress\\wp-content\\themes\\wpe\\node\_modules\\node-gyp\\node\_modules\\which\\which.js:89:16

npm ERR! gyp verb \`which\` failed at C:\\wamp64\\www\\wordpress\\wp-content\\themes\\wpe\\node\_modules\\isexe\\index.js:42:5

npm ERR! gyp verb \`which\` failed at C:\\wamp64\\www\\wordpress\\wp-content\\themes\\wpe\\node\_modules\\isexe\\windows.js:36:5npm ERR! gyp verb \`which\` failed at FSReqCallback.oncomplete (node:fs:198:21) {

npm ERR! gyp verb \`which\` failed code: ‘ENOENT’

npm ERR! gyp verb \`which\` failed }

npm ERR! gyp verb could not find “python”. checking python launcher

npm ERR! gyp verb could not find “python”. guessing location

npm ERR! gyp verb ensuring that file exists: C:\\Python27\\python.exe

npm ERR! gyp ERR! configure error

npm ERR! gyp ERR! stack Error: Can’t find Python executable “python”, you can set the PYTHON env variable.

npm ERR! gyp ERR! stack at PythonFinder.failNoPython (C:\\wamp64\\www\\wordpress\\wp-content\\themes\\wpe\\node\_modules\\node-gyp\\lib\\configure.js:484:19)

npm ERR! gyp ERR! stack at PythonFinder.<anonymous> (C:\\wamp64\\www\\wordpress\\wp-content\\themes\\wpe\\node\_modules\\node-gyp\\lib\\configure.js:509:16)

npm ERR! gyp ERR! stack at callback (C:\\wamp64\\www\\wordpress\\wp-content\\themes\\wpe\\node\_modules\\graceful-fs\\polyfills.js:306:20)

npm ERR! gyp ERR! stack at FSReqCallback.oncomplete (node:fs:198:21)

npm ERR! gyp ERR! System Windows\_NT 10.0.22000

npm ERR! gyp ERR! command “C:\\\\Program Files\\\\nodejs\\\\node.exe” “C:\\\\wamp64\\\\www\\\\wordpress\\\\wp-content\\\\themes\\\\wpe\\\\node\_modules\\\\node-gyp\\\\bin\\\\node-gyp.js” “rebuild” “–verbose” “–libsass\_ext=” “–libsass\_cflags=” “–libsass\_ldflags=” “–libsass\_library=”

npm ERR! gyp ERR! cwd C:\\wamp64\\www\\wordpress\\wp-content\\themes\\wpe\\node\_modules\\node-sass

npm ERR! gyp ERR! node -v v16.15.1

npm ERR! gyp ERR! node-gyp -v v3.8.0

npm ERR! gyp ERR! not ok

npm ERR! Build failed with error code: 1

&#x200B;

npm ERR! A complete log of this run can be found in:

npm ERR! C:\\Users\\Admin\\AppData\\Local\\npm-cache\\\_logs\\2022-08-05T11\_03\_58\_180Z-debug-0.log

&#x200B;

&#x200B;

In App.php line 158:

&#x200B;

The command “npm install” failed.

&#x200B;

Exit Code: 1(General error)

&#x200B;

Working directory: C:\\wamp64\\www\\wordpress\\wp-content\\themes\\wpe

&#x200B;

Output:

================

&#x200B;

&#x200B;

Error Output:

================

npm WARN deprecated stable@0.1.8: Modern JS already guarantees Array#sort() is a stable sort, so this library is de

precated. See the compatibility table on MDN: [https://developer.mozilla.org/en-US/docs/Web/JavaScript/Reference/Glo](https://developer.mozilla.org/en-US/docs/Web/JavaScript/Reference/Glo)

bal\_Objects/Array/sort#browser\_compatibility

npm WARN deprecated source-map-url@0.4.1: See [https://github.com/lydell/source-map-url#deprecated](https://github.com/lydell/source-map-url#deprecated)

npm WARN deprecated u/stylelint/postcss-markdown@0.36.2: Use the original unforked package instead: postcss-markdown

npm WARN deprecated har-validator@5.1.5: this library is no longer supported

npm WARN deprecated urix@0.1.0: Please see [https://github.com/lydell/urix#deprecated](https://github.com/lydell/urix#deprecated)

npm WARN deprecated source-map-resolve@0.5.3: See [https://github.com/lydell/source-map-resolve#deprecated](https://github.com/lydell/source-map-resolve#deprecated)

npm WARN deprecated chokidar@2.1.8: Chokidar 2 does not receive security updates since 2019. Upgrade to chokidar 3

with 15x fewer dependencies

npm WARN deprecated chokidar@2.1.8: Chokidar 2 does not receive security updates since 2019. Upgrade to chokidar 3

with 15x fewer dependencies

npm WARN deprecated resolve-url@0.2.1: [https://github.com/lydell/resolve-url#deprecated](https://github.com/lydell/resolve-url#deprecated)

npm WARN deprecated html-webpack-plugin@3.2.0: 3.x is no longer supported

npm WARN deprecated querystring@0.2.0: The querystring API is considered Legacy. new code should use the URLSearchP

arams API instead.

npm WARN deprecated uuid@3.4.0: Please upgrade to version 7 or higher. Older versions may use Math.random() in ce

rtain circumstances, which is known to be problematic. See [https://v8.dev/blog/math-random](https://v8.dev/blog/math-random) for details.

npm WARN deprecated request@2.88.2: request has been deprecated, see [https://github.com/request/request/issues/3142](https://github.com/request/request/issues/3142)

npm WARN deprecated svgo@1.3.2: This SVGO version is no longer supported. Upgrade to v2.x.x.

npm WARN deprecated tar@2.2.2: This version of tar is no longer supported, and will not receive security updates. P

lease upgrade asap.

npm WARN deprecated core-js@2.6.12: core-js@<3.23.3 is no longer maintained and not recommended for usage due to th

e number of issues. Because of the V8 engine whims, feature detection in old core-js versions could cause a slowdow

n up to 100x even if nothing is polyfilled. Some versions have web compatibility issues. Please, upgrade your depen

dencies to the actual version of core-js.

npm WARN cleanup Failed to remove some directories \[

npm WARN cleanup \[

npm WARN cleanup ‘C:\\\\wamp64\\\\www\\\\wordpress\\\\wp-content\\\\themes\\\\wpe\\\\node\_modules’,

npm WARN cleanup \[Error: EBUSY: resource busy or locked, rmdir ‘C:\\wamp64\\www\\wordpress\\wp-content\\themes\\wpe\\n

ode\_modules\\jpegtran-bin’\] {

npm WARN cleanup errno: -4082,

npm WARN cleanup code: ‘EBUSY’,

npm WARN cleanup syscall: ‘rmdir’,

npm WARN cleanup path: ‘C:\\\\wamp64\\\\www\\\\wordpress\\\\wp-content\\\\themes\\\\wpe\\\\node\_modules\\\\jpegtran-bin’

npm WARN cleanup }

npm WARN cleanup \]

npm WARN cleanup \]

npm ERR! code 1

npm ERR! path C:\\wamp64\\www\\wordpress\\wp-content\\themes\\wpe\\node\_modules\\node-sass

npm ERR! command failed

npm ERR! command C:\\WINDOWS\\system32\\cmd.exe /d /s /c C:\\Users\\Admin\\AppData\\Local\\Temp\\postinstall-7f969d63.cmd

npm ERR! Building: C:\\Program Files\\nodejs\\node.exe C:\\wamp64\\www\\wordpress\\wp-content\\themes\\wpe\\node\_modules\\node

\-gyp\\bin\\node-gyp.js rebuild –verbose –libsass\_ext= –libsass\_cflags= –libsass\_ldflags= –libsass\_library=

npm ERR! gyp info it worked if it ends with ok

npm ERR! gyp verb cli \[

npm ERR! gyp verb cli ‘C:\\\\Program Files\\\\nodejs\\\\node.exe’,

npm ERR! gyp verb cli ‘C:\\\\wamp64\\\\www\\\\wordpress\\\\wp-content\\\\themes\\\\wpe\\\\node\_modules\\\\node-gyp\\\\bin\\\\node-gyp

.js’,

npm ERR! gyp verb cli ‘rebuild’,

npm ERR! gyp verb cli ‘–verbose’,

npm ERR! gyp verb cli ‘–libsass\_ext=’,

npm ERR! gyp verb cli ‘–libsass\_cflags=’,

npm ERR! gyp verb cli ‘–libsass\_ldflags=’,

npm ERR! gyp verb cli ‘–libsass\_library=’

npm ERR! gyp verb cli \]

npm ERR! gyp info using node-gyp@3.8.0

npm ERR! gyp info using node@16.15.1 | win32 | x64

npm ERR! gyp verb command rebuild \[\]

npm ERR! gyp verb command clean \[\]

npm ERR! gyp verb clean removing “build” directory

npm ERR! gyp verb command configure \[\]

npm ERR! gyp verb check python checking for Python executable “python2” in the PATH

npm ERR! gyp verb \`which\` failed Error: not found: python2

npm ERR! gyp verb \`which\` failed at getNotFoundError (C:\\wamp64\\www\\wordpress\\wp-content\\themes\\wpe\\node\_module

s\\node-gyp\\node\_modules\\which\\which.js:13:12)

npm ERR! gyp verb \`which\` failed at F (C:\\wamp64\\www\\wordpress\\wp-content\\themes\\wpe\\node\_modules\\node-gyp\\node

\_modules\\which\\which.js:68:19)

npm ERR! gyp verb \`which\` failed at E (C:\\wamp64\\www\\wordpress\\wp-content\\themes\\wpe\\node\_modules\\node-gyp\\node

\_modules\\which\\which.js:80:29)

npm ERR! gyp verb \`which\` failed at C:\\wamp64\\www\\wordpress\\wp-content\\themes\\wpe\\node\_modules\\node-gyp\\node\_mo

dules\\which\\which.js:89:16

npm ERR! gyp verb \`which\` failed at C:\\wamp64\\www\\wordpress\\wp-content\\themes\\wpe\\node\_modules\\isexe\\index.js:4

2:5

npm ERR! gyp verb \`which\` failed at C:\\wamp64\\www\\wordpress\\wp-content\\themes\\wpe\\node\_modules\\isexe\\windows.js

:36:5

npm ERR! gyp verb \`which\` failed at FSReqCallback.oncomplete (node:fs:198:21)

npm ERR! gyp verb \`which\` failed python2 Error: not found: python2

npm ERR! gyp verb \`which\` failed at getNotFoundError (C:\\wamp64\\www\\wordpress\\wp-content\\themes\\wpe\\node\_module

s\\node-gyp\\node\_modules\\which\\which.js:13:12)

npm ERR! gyp verb \`which\` failed at F (C:\\wamp64\\www\\wordpress\\wp-content\\themes\\wpe\\node\_modules\\node-gyp\\node

\_modules\\which\\which.js:68:19)

npm ERR! gyp verb \`which\` failed at E (C:\\wamp64\\www\\wordpress\\wp-content\\themes\\wpe\\node\_modules\\node-gyp\\node

\_modules\\which\\which.js:80:29)

npm ERR! gyp verb \`which\` failed at C:\\wamp64\\www\\wordpress\\wp-content\\themes\\wpe\\node\_modules\\node-gyp\\node\_mo

dules\\which\\which.js:89:16

npm ERR! gyp verb \`which\` failed at C:\\wamp64\\www\\wordpress\\wp-content\\themes\\wpe\\node\_modules\\isexe\\index.js:4

2:5

npm ERR! gyp verb \`which\` failed at C:\\wamp64\\www\\wordpress\\wp-content\\themes\\wpe\\node\_modules\\isexe\\windows.js

:36:5

npm ERR! gyp verb \`which\` failed at FSReqCallback.oncomplete (node:fs:198:21) {

npm ERR! gyp verb \`which\` failed code: ‘ENOENT’

npm ERR! gyp verb \`which\` failed }

npm ERR! gyp verb check python checking for Python executable “python” in the PATH

npm ERR! gyp verb \`which\` failed Error: not found: python

npm ERR! gyp verb \`which\` failed at getNotFoundError (C:\\wamp64\\www\\wordpress\\wp-content\\themes\\wpe\\node\_module

s\\node-gyp\\node\_modules\\which\\which.js:13:12)

npm ERR! gyp verb \`which\` failed at F (C:\\wamp64\\www\\wordpress\\wp-content\\themes\\wpe\\node\_modules\\node-gyp\\node

\_modules\\which\\which.js:68:19)

npm ERR! gyp verb \`which\` failed at E (C:\\wamp64\\www\\wordpress\\wp-content\\themes\\wpe\\node\_modules\\node-gyp\\node

\_modules\\which\\which.js:80:29)

npm ERR! gyp verb \`which\` failed at C:\\wamp64\\www\\wordpress\\wp-content\\themes\\wpe\\node\_modules\\node-gyp\\node\_mo

dules\\which\\which.js:89:16

npm ERR! gyp verb \`which\` failed at C:\\wamp64\\www\\wordpress\\wp-content\\themes\\wpe\\node\_modules\\isexe\\index.js:4

2:5

npm ERR! gyp verb \`which\` failed at C:\\wamp64\\www\\wordpress\\wp-content\\themes\\wpe\\node\_modules\\isexe\\windows.js

:36:5

npm ERR! gyp verb \`which\` failed at FSReqCallback.oncomplete (node:fs:198:21)

npm ERR! gyp verb \`which\` failed python Error: not found: python

npm ERR! gyp verb \`which\` failed at getNotFoundError (C:\\wamp64\\www\\wordpress\\wp-content\\themes\\wpe\\node\_module

s\\node-gyp\\node\_modules\\which\\which.js:13:12)

npm ERR! gyp verb \`which\` failed at F (C:\\wamp64\\www\\wordpress\\wp-content\\themes\\wpe\\node\_modules\\node-gyp\\node

\_modules\\which\\which.js:68:19)

npm ERR! gyp verb \`which\` failed at E (C:\\wamp64\\www\\wordpress\\wp-content\\themes\\wpe\\node\_modules\\node-gyp\\node

\_modules\\which\\which.js:80:29)

npm ERR! gyp verb \`which\` failed at C:\\wamp64\\www\\wordpress\\wp-content\\themes\\wpe\\node\_modules\\node-gyp\\node\_mo

dules\\which\\which.js:89:16

npm ERR! gyp verb \`which\` failed at C:\\wamp64\\www\\wordpress\\wp-content\\themes\\wpe\\node\_modules\\isexe\\index.js:4

2:5

npm ERR! gyp verb \`which\` failed at C:\\wamp64\\www\\wordpress\\wp-content\\themes\\wpe\\node\_modules\\isexe\\windows.js

:36:5

npm ERR! gyp verb \`which\` failed at FSReqCallback.oncomplete (node:fs:198:21) {

npm ERR! gyp verb \`which\` failed code: ‘ENOENT’

npm ERR! gyp verb \`which\` failed }

npm ERR! gyp verb could not find “python”. checking python launcher

npm ERR! gyp verb could not find “python”. guessing location

npm ERR! gyp verb ensuring that file exists: C:\\Python27\\python.exe

npm ERR! gyp ERR! configure error

npm ERR! gyp ERR! stack Error: Can’t find Python executable “python”, you can set the PYTHON env variable.

npm ERR! gyp ERR! stack at PythonFinder.failNoPython (C:\\wamp64\\www\\wordpress\\wp-content\\themes\\wpe\\node\_module

s\\node-gyp\\lib\\configure.js:484:19)

npm ERR! gyp ERR! stack at PythonFinder.<anonymous> (C:\\wamp64\\www\\wordpress\\wp-content\\themes\\wpe\\node\_modules

\\node-gyp\\lib\\configure.js:509:16)

npm ERR! gyp ERR! stack at callback (C:\\wamp64\\www\\wordpress\\wp-content\\themes\\wpe\\node\_modules\\graceful-fs\\pol

yfills.js:306:20)

npm ERR! gyp ERR! stack at FSReqCallback.oncomplete (node:fs:198:21)

npm ERR! gyp ERR! System Windows\_NT 10.0.22000

npm ERR! gyp ERR! command “C:\\\\Program Files\\\\nodejs\\\\node.exe” “C:\\\\wamp64\\\\www\\\\wordpress\\\\wp-content\\\\themes\\\\wp

e\\\\node\_modules\\\\node-gyp\\\\bin\\\\node-gyp.js” “rebuild” “–verbose” “–libsass\_ext=” “–libsass\_cflags=” “–libsass\_

ldflags=” “–libsass\_library=”

npm ERR! gyp ERR! cwd C:\\wamp64\\www\\wordpress\\wp-content\\themes\\wpe\\node\_modules\\node-sass

npm ERR! gyp ERR! node -v v16.15.1

npm ERR! gyp ERR! node-gyp -v v3.8.0

npm ERR! gyp ERR! not ok

npm ERR! Build failed with error code: 1

&#x200B;

npm ERR! A complete log of this run can be found in:

npm ERR! C:\\Users\\Admin\\AppData\\Local\\npm-cache\\\_logs\\2022-08-05T11\_03\_58\_180Z-debug-0.log

&#x200B;

&#x200B;

install:dependencies

&#x200B;

Script u/php wpemerge install:dependencies handling the install-dev-env event returned with error code 1

Script u/install-dev-env was called via post-create-project-cmd

 

This site will teach you how to build a WordPress website for beginners. We will cover everything from installing WordPress to adding pages, posts, and images to your site. You will learn how to customize your site with themes and plugins, as well as how to market your site online.

Your Advertisement Here